{"text_format":"1","workbook":"xlsx","n_sheets":8,"sheets":["template","template legend","checks","variable checks","readme","validation","validation detail","lookups"],"not_rendered":{"charts":0,"images":1,"macros":1,"external_links":0,"defined_names":54,"comments":1,"pivot_tables":0},"unopened":[],"bounds":{"document_bytes":16777216,"sheet_cells":100000,"rows_first":2000,"rows_last":500,"rows_between":2000,"halvings":0,"cell_chars":16384,"cell_head_chars":4096},"cells_cut":0,"cells_raw":0,"read":"whole","date_system":"1900"}

{"sheet":"template","index":0,"n_rows":1,"n_cols":20,"rows_kept":1,"cut":false,"hidden":false,"merged":[]}
["setting","date","source","indicator_abbr","indicator_name","dimension","subgroup","estimate","se","ci_lb","ci_ub","population","note","setting_average","iso3","favourable_indicator","indicator_scale","ordered_dimension","subgroup_order","reference_subgroup"]

{"sheet":"template legend","index":1,"n_rows":26,"n_cols":5,"rows_kept":26,"cut":false,"hidden":false,"merged":[]}
[null,"COLOUR LEGEND"]
[null,"Mandatory variable"]
[null,"Recommended variable"]
[null,"Optional variable"]
[]
[null,"VARIABLE","TYPE","DEFINITION","NOTE"]
[null,"setting","Mandatory","Setting name (e.g. a country like \"Indonesia\", or a province like \"Bali\")","If this variable is missing, data cannot be uploaded. "]
[null,"date","Mandatory","Date of the data (e.g. years, months, weeks, days, or another date format). Note that dates should be sortable numerically / alphabetically in chronological order to ensure correct display in HEAT Plus visuals. For example, monthly data is best entered with the year and month number (e.g. \"2022-12\" and \"2023-04\") instead of text (e.g. December 2022 and \"April 2023\")","If this variable is missing, data cannot be uploaded. "]
{"$rows_left_out":19}
{"sheet":"checks","index":2,"n_rows":37,"n_cols":114,"rows_kept":37,"cut":false,"hidden":true,"merged":[]}
[null,null,null,null,null,null,null,null,null,null,null,null,null,null,null,null,null,null,null,null,null,null,null,null,null,null,null,null,null,null,null,null,null,null,null,null,null,null,null,{"$f":"COUNTIF(AN3:AN1048576,\">\"&0)","v":34},{"$f":"COUNTIF(AO3:AO1048576,1)","v":0},0,0,0,0,0,0,0,0,0,0,0,0,0,0,0,0,0,0,0,null,{"$f":"COUNTIF(BJ3:BJ1048576,1)","v":0},{"$f":"COUNTIF(BK3:BK1048576,1)","v":0},{"$f":"COUNTIF(BL3:BL1048576,1)","v":0},null,null,null,{"$f":"COUNTIF(BP3:BP1048576,1)","v":0},{"$f":"COUNTIF(BQ3:BQ1048576,1)","v":0},null,null,null,{"$f":"COUNTIF(BU3:BU1048576,1)","v":0},null,null,null,{"$f":"COUNTIF(BY3:BY1048576,1)","v":0},null,null,null,{"$f":"COUNTIF(CC3:CC1048576,1)","v":0},null,null,null,null,{"$f":"COUNTIF(CH3:CH1048576,1)","v":0},null,null,null,{"$f":"COUNTIF(CL3:CL1048576,1)","v":0},null,null,null,null,null,null,null,null,{"$f":"COUNTIF(CU3:CU1048576,1)","v":0},null,null,null,null,null,null,null,{"$f":"COUNTIF(DC3:DC1048576,1)","v":0},null,null,null,null,null,null,{"$f":"COUNTIF(DJ3:DJ1048576,1)","v":0}]
["setting","year","source","indicator_abbr","indicator_name","dimension","subgroup","estimate","se","ci_lb","ci_ub","population","flag","setting_average","iso3","favourable_indicator","indicator_scale","ordered_dimension","subgroup_order","reference_subgroup","record","row number","setting","year","source","indicator_abbr","indicator_name","dimension","subgroup","estimate","se","population","setting_average","iso3","favourable_indicator","indicator_scale","ordered_dimension","subgroup_order","reference_subgroup","missing data","setting","year","source","indicator_abbr","indicator_name","dimension","subgroup","estimate","se","ci_lb","ci_ub","population","flag","setting_average","iso3","favourable_indicator","indicator_scale","ordered_dimension","subgroup_order","reference_subgroup",null,"iso3 check","subgroup_order_check","reference_subgroup_check",null,"indicator_abbr","indicator_name",{"$f":"IF(COUNTIF(BN:BN,BN2)>1,1,0)","v":0},{"$f":"IF(COUNTIF(BO:BO,BO2)>1,1,0)","v":0},null,"setting","iso3",{"$f":"IF(BS2=\"\",0,IF(COUNTIF(BS:BS,BS2)>1,1,0))","v":0},null,"dimension","ordered_dimension",{"$f":"IF(BW2=\"\",0,IF(COUNTIF(BW:BW,BW2)>1,1,0))","v":0},null,"indicator_abbr","favourable_indicator",{"$f":"IF(CA2=\"\",0,IF(COUNTIF(CA:CA,CA2)>1,1,0))","v":0},null,null,"indicator_abbr","indicator_scale",{"$f":"IF(CF2=\"\",0,IF(COUNTIF(CF:CF,CF2)>1,1,0))","v":0},null,"subgroup","subgroup_order",{"$f":"IF(CJ2=\"\",0,IF(COUNTIF(CJ:CJ,CJ2)>1,1,0))","v":0},null,"setting","year","source","indicator_abbr","indicator_name","setting_average",{"$f":"_xlfn.CONCAT(CN2,CO2,CP2,CQ2,CR2)","v":"settingyearsourceindicator_abbrindicator_name"},{"$f":"IF(CN2=\"\",0,IF(COUNTIF(CT:CT,CT2)>1,1,0))","v":0},null,"setting","date","source","indicator_abbr","dimension","subgroup_order",{"$f":"IF(CW2=\"\",0,IFERROR(IF(DB2=1,0,IF(AND(CW2=CW1,DB2-DB1=1),0,1)),0))","v":0},null,"setting","date","source","indicator_abbr","dimension",{"$f":"IF(SUMIFS(template!$T:$T,template!A:A,checks!DE2,template!B:B,checks!DF2,template!D:D,checks!DH2,template!F:F,checks!DI2)>1,1,0)","v":0}]
["Indonesia",2017,"ICEH - DHS","anc1","Antenatal care coverage - at least one visit (%) (in the two or three years preceding the survey)","Subnational region","yogyakarta",97.662567138671903,null,90.657257080078097,99.447235107421903,126.87433624267599,"Re-analysis of DHS/MICS/RHS data by ICEH (WHO Collaborating Center for Health Inequality Monitoring).",97.388114929199205,"IDN",1,100,0,0,null,{"$f":"IF(A3<>\"\",1,0)","v":1},{"$f":"ROW()","v":3},{"$f":"IF(AND(E3<>\"\",A3=\"\"),1,0)","v":0},{"$f":"IF(AND($U3=1,B3=\"\"),1,0)","v":0},{"$f":"IF(AND($U3=1,C3=\"\"),1,0)","v":0},{"$f":"IF(AND($U3=1,D3=\"\"),1,0)","v":0},{"$f":"IF(AND($U3=1,E3=\"\"),1,0)","v":0},{"$f":"IF(AND($U3=1,F3=\"\"),1,0)","v":0},{"$f":"IF(AND($U3=1,G3=\"\"),1,0)","v":0},{"$f":"IF(AND($U3=1,H3=\"\"),1,0)","v":0},{"$f":"IF(AND($U3=1,I3=\"\"),1,0)","v":1},{"$f":"IF(AND($U3=1,L3=\"\"),1,0)","v":0},{"$f":"IF(AND($U3=1,N3=\"\"),1,0)","v":0},{"$f":"IF(AND($U3=1,O3=\"\"),1,0)","v":0},{"$f":"IF(AND($U3=1,P3=\"\"),1,0)","v":0},{"$f":"IF(AND($U3=1,Q3=\"\"),1,0)","v":0},{"$f":"IF(AND($U3=1,R3=\"\"),1,0)","v":0},{"$f":"IF(AND($U3=1,S3=\"\"),1,0)","v":0},{"$f":"IF(AND($U3=1,T3=\"\"),1,0)","v":1},{"$f":"IF(SUM(W3:AD3,AI3:AM3)>0,1,0)","v":1},{"$f":"IF(AND($U3=1,W3=0),IF(ISTEXT(A3)=FALSE,1,0),0)","v":0},{"$f":"IF(AND($U3=1,X3=0),IF(AND(LEN(B3)=4,ISNUMBER(B3)=TRUE),0,1),0)","v":0},{"$f":"IF(AND($U3=1,Y3=0),IF(ISTEXT(C3)=FALSE,1,0),0)","v":0},{"$f":"IF(AND($U3=1,Z3=0),IF(ISTEXT(D3)=FALSE,1,0),0)","v":0},{"$f":"IF(AND($U3=1,AA3=0),IF(ISTEXT(E3)=FALSE,1,0),0)","v":0},{"$f":"IF(AND($U3=1,AB3=0),IF(ISTEXT(F3)=FALSE,1,0),0)","v":0},{"$f":"IF(AND($U3=1,AC3=0),IF(ISTEXT(G3)=FALSE,1,0),0)","v":0},{"$f":"IF(H3=\"\",\"\",IF(AND($U3=1,AD3=0),IF(AND(ISNUMBER(H3),H3>=0),0,1),0))","v":0},{"$f":"IF(I3=\"\",\"\",IF(AND($U3=1,AE3=0),IF(AND(ISNUMBER(I3),I3>=0),0,1),0))","v":""},{"$f":"IF(J3=\"\",\"\",IF($U3=1,IF(AND(ISNUMBER(J3),J3>=0),0,1),0))","v":0},{"$f":"IF(K3=\"\",\"\",IF($U3=1,IF(AND(ISNUMBER(K3),K3>=0),0,1),0))","v":0},{"$f":"IF(L3=\"\",\"\",IF($U3=1,IF(AND(ISNUMBER(L3),L3>=0),0,1),0))","v":0},null,{"$f":"IF(N3=\"\",\"\",IF($U3=1,IF(AND(ISNUMBER(N3),N3>=0),0,1),0))","v":0},{"$f":"IF(AH3=1,\"\",IF($U3=1,IF(AND(LEN(O3)=3,ISTEXT(O3)=TRUE),0,1),0))","v":0},{"$f":"IF(AND($U3=1,AI3=0),IF(OR(P3=1,P3=0),0,1),0)","v":0},{"$f":"IF(AND($U3=1,AJ3=0),IF(Q3>=0,0,1),0)","v":0},{"$f":"IF(AND($U3=1,AK3=0),IF(OR(R3=1,R3=0),0,1),0)","v":0},{"$f":"IF(AND($U3=1,AL3=0),IF(S3>=0,0,1),0)","v":0},{"$f":"IF(AND($U3=1,AM3=0),IF(OR(T3=1,T3=0),0,1),0)","v":0},null,{"$f":"IF(U3=0,0,IF(AH3=0,IF(IFERROR(VLOOKUP(O3,lookups!$A:$A,1,FALSE),1)=1,1,0),0))","v":0},{"$f":"IF(AND(R3=0,S3<>0),1,IF(AND(R3=1,S3<1),1,0))","v":0},{"$f":"IF(AND(R3=1,T3<>0),1,0)","v":0},null,"anc1","Antenatal care coverage - at least one visit (%) (in the two or three years preceding the survey)",0,0,null,"Indonesia","IDN",0,null,"Subnational region",0,0,null,"anc1",1,0,null,null,"anc1",100,0,null,"yogyakarta",0,0,null,"Indonesia",2017,"ICEH - DHS","anc1","Antenatal care coverage - at least one visit (%) (in the two or three years preceding the survey)",97.388114929199205,"Indonesia2017ICEH - DHSanc1Antenatal care coverage - at least one visit (%) (in the two or three years preceding the survey)",0,null,null,null,null,null,null,null,0,null,"Indonesia",2017,"ICEH - DHS","anc1","Subnational region",{"$f":"IF(SUMIFS(template!$T:$T,template!A:A,checks!DE3,template!B:B,checks!DF3,template!D:D,checks!DH3,template!F:F,checks!DI3)>1,1,0)","v":0}]
["Indonesia",2017,"ICEH - DHS","anc1","Antenatal care coverage - at least one visit (%) (in the two or three years preceding the survey)","Subnational region","west sumatera",99.258529663085895,null,94.928398132324205,99.895660400390597,185.02243041992199,"Re-analysis of DHS/MICS/RHS data by ICEH (WHO Collaborating Center for Health Inequality Monitoring).",97.388114929199205,"IDN",1,100,0,0,null,1,{"$f":"ROW()","v":4},0,0,0,0,0,0,0,0,1,0,0,0,0,0,0,0,1,1,0,0,0,0,0,0,0,0,"",0,0,0,null,0,0,0,0,0,0,0,null,{"$f":"IF(U4=0,0,IF(AH4=0,IF(IFERROR(VLOOKUP(O4,lookups!$A:$A,1,FALSE),1)=1,1,0),0))","v":0},0,0,null,null,null,0,0,null,null,null,0,null,null,null,0,null,null,null,0,null,null,null,null,0,null,"west sumatera",0,0,null,null,null,null,null,null,null,"",0,null,null,null,null,null,null,null,0,null,null,null,null,null,null,{"$f":"IF(SUMIFS(template!$T:$T,template!A:A,checks!DE4,template!B:B,checks!DF4,template!D:D,checks!DH4,template!F:F,checks!DI4)>1,1,0)","v":0}]
["Indonesia",2017,"ICEH - DHS","anc1","Antenatal care coverage - at least one visit (%) (in the two or three years preceding the survey)","Subnational region","west sulawesi",98.006393432617202,null,95.336624145507798,99.161178588867202,51.516090393066399,"Re-analysis of DHS/MICS/RHS data by ICEH (WHO Collaborating Center for Health Inequality Monitoring).",97.388114929199205,"IDN",1,100,0,0,null,1,{"$f":"ROW()","v":5},0,0,0,0,0,0,0,0,1,0,0,0,0,0,0,0,1,1,0,0,0,0,0,0,0,0,"",0,0,0,null,0,0,0,0,0,0,0,null,{"$f":"IF(U5=0,0,IF(AH5=0,IF(IFERROR(VLOOKUP(O5,lookups!$A:$A,1,FALSE),1)=1,1,0),0))","v":0},0,0,null,null,null,0,0,null,null,null,0,null,null,null,0,null,null,null,0,null,null,null,null,0,null,"west sulawesi",0,0,null,null,null,null,null,null,null,"",0,null,null,null,null,null,null,null,0,null,null,null,null,null,null,{"$f":"IF(SUMIFS(template!$T:$T,template!A:A,checks!DE5,template!B:B,checks!DF5,template!D:D,checks!DH5,template!F:F,checks!DI5)>1,1,0)","v":0}]
["Indonesia",2017,"ICEH - DHS","anc1","Antenatal care coverage - at least one visit (%) (in the two or three years preceding the survey)","Subnational region","west papua",88.298477172851605,null,81.985031127929702,92.599067687988295,35.989551544189503,"Re-analysis of DHS/MICS/RHS data by ICEH (WHO Collaborating Center for Health Inequality Monitoring).",97.388114929199205,"IDN",1,100,0,0,null,1,{"$f":"ROW()","v":6},0,0,0,0,0,0,0,0,1,0,0,0,0,0,0,0,1,1,0,0,0,0,0,0,0,0,"",0,0,0,null,0,0,0,0,0,0,0,null,{"$f":"IF(U6=0,0,IF(AH6=0,IF(IFERROR(VLOOKUP(O6,lookups!$A:$A,1,FALSE),1)=1,1,0),0))","v":0},0,0,null,null,null,0,0,null,null,null,0,null,null,null,0,null,null,null,0,null,null,null,null,0,null,"west papua",0,0,null,null,null,null,null,null,null,"",0,null,null,null,null,null,null,null,0,null,null,null,null,null,null,{"$f":"IF(SUMIFS(template!$T:$T,template!A:A,checks!DE6,template!B:B,checks!DF6,template!D:D,checks!DH6,template!F:F,checks!DI6)>1,1,0)","v":0}]
["Indonesia",2017,"ICEH - DHS","anc1","Antenatal care coverage - at least one visit (%) (in the two or three years preceding the survey)","Subnational region","west nusa tenggara",99.8095703125,null,98.662361145019503,99.973159790039105,214.22901916503901,"Re-analysis of DHS/MICS/RHS data by ICEH (WHO Collaborating Center for Health Inequality Monitoring).",97.388114929199205,"IDN",1,100,0,0,null,1,{"$f":"ROW()","v":7},0,0,0,0,0,0,0,0,1,0,0,0,0,0,0,0,1,1,0,0,0,0,0,0,0,0,"",0,0,0,null,0,0,0,0,0,0,0,null,{"$f":"IF(U7=0,0,IF(AH7=0,IF(IFERROR(VLOOKUP(O7,lookups!$A:$A,1,FALSE),1)=1,1,0),0))","v":0},0,0,null,null,null,0,0,null,null,null,0,null,null,null,0,null,null,null,0,null,null,null,null,0,null,"west nusa tenggara",0,0,null,null,null,null,null,null,null,"",0,null,null,null,null,null,null,null,0,null,null,null,null,null,null,{"$f":"IF(SUMIFS(template!$T:$T,template!A:A,checks!DE7,template!B:B,checks!DF7,template!D:D,checks!DH7,template!F:F,checks!DI7)>1,1,0)","v":0}]
["Indonesia",2017,"ICEH - DHS","anc1","Antenatal care coverage - at least one visit (%) (in the two or three years preceding the survey)","Subnational region","west kalimantan",96.143493652343807,null,90.658920288085895,98.462432861328097,204.98158264160199,"Re-analysis of DHS/MICS/RHS data by ICEH (WHO Collaborating Center for Health Inequality Monitoring).",97.388114929199205,"IDN",1,100,0,0,null,1,{"$f":"ROW()","v":8},0,0,0,0,0,0,0,0,1,0,0,0,0,0,0,0,1,1,0,0,0,0,0,0,0,0,"",0,0,0,null,0,0,0,0,0,0,0,null,{"$f":"IF(U8=0,0,IF(AH8=0,IF(IFERROR(VLOOKUP(O8,lookups!$A:$A,1,FALSE),1)=1,1,0),0))","v":0},0,0,null,null,null,0,0,null,null,null,0,null,null,null,0,null,null,null,0,null,null,null,null,0,null,"west kalimantan",0,0,null,null,null,null,null,null,null,"",0,null,null,null,null,null,null,null,0,null,null,null,null,null,null,{"$f":"IF(SUMIFS(template!$T:$T,template!A:A,checks!DE8,template!B:B,checks!DF8,template!D:D,checks!DH8,template!F:F,checks!DI8)>1,1,0)","v":0}]
{"$rows_left_out":30}
{"sheet":"variable checks","index":3,"n_rows":35,"n_cols":25,"rows_kept":35,"cut":false,"hidden":true,"merged":[]}
["setting","date","source","indicator_abbr","indicator_name","dimension","subgroup","estimate","se","ci_lb","ci_ub","population","note","setting_average","iso3","favourable_indicator","indicator_scale","ordered_dimension","subgroup_order","reference_subgroup",null,null,"Variable","Variable",{"$f":"COUNTIF(E2:E21,1)","v":0}]
["Indonesia",2017,"ICEH - DHS","anc1","Antenatal care coverage - at least one visit (%) (in the two or three years preceding the survey)","Subnational region","yogyakarta",97.662567138671903,null,90.657257080078097,99.447235107421903,126.87433624267599,"Re-analysis of DHS/MICS/RHS data by ICEH (WHO Collaborating Center for Health Inequality Monitoring).",97.388114929199205,"IDN",1,100,0,0,null,null,null,"setting",{"$f":"INDEX(template!$1:$1,,MATCH(W2,template!$1:$1,0))","v":"setting"},{"$f":"IF(IFERROR(X2,1)=1,1,0)","v":0}]
["Indonesia",2017,"ICEH - DHS","anc1","Antenatal care coverage - at least one visit (%) (in the two or three years preceding the survey)","Subnational region","west sumatera",99.258529663085895,null,94.928398132324205,99.895660400390597,185.02243041992199,"Re-analysis of DHS/MICS/RHS data by ICEH (WHO Collaborating Center for Health Inequality Monitoring).",97.388114929199205,"IDN",1,100,0,0,null,null,null,"date",{"$f":"INDEX(template!$1:$1,,MATCH(W3,template!$1:$1,0))","v":"date"},{"$f":"IF(IFERROR(X3,1)=1,1,0)","v":0}]
["Indonesia",2017,"ICEH - DHS","anc1","Antenatal care coverage - at least one visit (%) (in the two or three years preceding the survey)","Subnational region","west sulawesi",98.006393432617202,null,95.336624145507798,99.161178588867202,51.516090393066399,"Re-analysis of DHS/MICS/RHS data by ICEH (WHO Collaborating Center for Health Inequality Monitoring).",97.388114929199205,"IDN",1,100,0,0,null,null,null,"source",{"$f":"INDEX(template!$1:$1,,MATCH(W4,template!$1:$1,0))","v":"source"},0]
["Indonesia",2017,"ICEH - DHS","anc1","Antenatal care coverage - at least one visit (%) (in the two or three years preceding the survey)","Subnational region","west papua",88.298477172851605,null,81.985031127929702,92.599067687988295,35.989551544189503,"Re-analysis of DHS/MICS/RHS data by ICEH (WHO Collaborating Center for Health Inequality Monitoring).",97.388114929199205,"IDN",1,100,0,0,null,null,null,"indicator_abbr",{"$f":"INDEX(template!$1:$1,,MATCH(W5,template!$1:$1,0))","v":"indicator_abbr"},0]
["Indonesia",2017,"ICEH - DHS","anc1","Antenatal care coverage - at least one visit (%) (in the two or three years preceding the survey)","Subnational region","west nusa tenggara",99.8095703125,null,98.662361145019503,99.973159790039105,214.22901916503901,"Re-analysis of DHS/MICS/RHS data by ICEH (WHO Collaborating Center for Health Inequality Monitoring).",97.388114929199205,"IDN",1,100,0,0,null,null,null,"indicator_name",{"$f":"INDEX(template!$1:$1,,MATCH(W6,template!$1:$1,0))","v":"indicator_name"},0]
["Indonesia",2017,"ICEH - DHS","anc1","Antenatal care coverage - at least one visit (%) (in the two or three years preceding the survey)","Subnational region","west kalimantan",96.143493652343807,null,90.658920288085895,98.462432861328097,204.98158264160199,"Re-analysis of DHS/MICS/RHS data by ICEH (WHO Collaborating Center for Health Inequality Monitoring).",97.388114929199205,"IDN",1,100,0,0,null,null,null,"dimension",{"$f":"INDEX(template!$1:$1,,MATCH(W7,template!$1:$1,0))","v":"dimension"},0]
["Indonesia",2017,"ICEH - DHS","anc1","Antenatal care coverage - at least one visit (%) (in the two or three years preceding the survey)","Subnational region","west java",98.154464721679702,null,96.696601867675795,98.975753784179702,1926.65344238281,"Re-analysis of DHS/MICS/RHS data by ICEH (WHO Collaborating Center for Health Inequality Monitoring).",97.388114929199205,"IDN",1,100,0,0,null,null,null,"subgroup",{"$f":"INDEX(template!$1:$1,,MATCH(W8,template!$1:$1,0))","v":"subgroup"},0]
{"$rows_left_out":28}
{"sheet":"readme","index":4,"n_rows":46,"n_cols":12,"rows_kept":46,"cut":false,"hidden":false,"merged":[[45,1,45,10],[17,1,17,10],[37,1,37,10],[32,1,32,10],[38,1,38,10],[39,1,39,10]]}
[]
[]
[]
[]
[]
[]
[]
[null,null,null,null,null,null,null,null,null,null,null,"Template and Validation Tool"]
{"$rows_left_out":39}
{"sheet":"validation","index":5,"n_rows":83,"n_cols":16,"rows_kept":83,"cut":false,"hidden":false,"merged":[[0,4,0,17],[2,4,2,18],[8,8,13,9],[9,10,13,14],[8,10,8,14]]}
[null,null,null,null,"VALIDATION CHECKS"]
[]
[null,null,null,null,"To help ensure that the data entered into this template can be successfully uploaded into HEAT Plus, validation checks have been built into this tool. \nOnce you have entered your disaggregated data into the 'template' tab, click on the button below to start the validation checks. Please wait while the checks run. \nEnsure you have macros enabled first, by clicking 'Enable Content' in the yellow warning ribbon at the top of this page.\nOnce any data is changed in the template, the validation checks can be re-run if needed by clicking the button again. "]
[]
[]
[]
[]
[]
{"$rows_left_out":76}
{"sheet":"validation detail","index":6,"n_rows":37,"n_cols":68,"rows_kept":37,"cut":false,"hidden":false,"merged":[]}
[{"$f":"IF(SUM(A4:A65703)=0,\"Yes\",\"No\")","v":"No"},{"$f":"IF(AND(A1=\"No\",(IF(OR(C1=\"No\",D1=\"No\",E1=\"No\",F1=\"No\",G1=\"No\",H1=\"No\",I1=\"No\",J1=\"No\",K1=\"No\",L1=\"No\",M1=\"No\",N1=\"No\",O1=\"No\",P1=\"No\",Q1=\"No\",R1=\"No\",S1=\"No\",T1=\"No\",U1=\"No\",V1=\"No\"),1,0))=1),\"No\",\"Yes\")","v":{"$error":"#REF!"}},{"$f":"validation!A19","v":"Yes"},{"$f":"validation!#REF!","v":{"$error":"#REF!"}},{"$f":"validation!A24","v":"Yes"},{"$f":"validation!A27","v":"Yes"},{"$f":"validation!A31","v":"Yes"},{"$f":"validation!A34","v":"Yes"},{"$f":"validation!A37","v":"Yes"},{"$f":"validation!A40","v":"Yes"},{"$f":"validation!A43","v":"Yes"},{"$f":"validation!A45","v":"Yes"},{"$f":"validation!A47","v":"Yes"},{"$f":"validation!A50","v":"Yes"},"Yes",{"$f":"validation!A53","v":"Yes"},{"$f":"validation!A57","v":"Yes"},{"$f":"validation!A62","v":"Yes"},{"$f":"validation!A66","v":"Yes"},{"$f":"validation!A70","v":"Yes"},{"$f":"validation!A74","v":"Yes"},{"$f":"validation!A80","v":"Yes"},{"$f":"X1","v":"Yes"},{"$f":"validation!A28","v":"Yes"},{"$f":"X1","v":"Yes"},{"$f":"AA1","v":"Yes"},{"$f":"validation!A54","v":"Yes"},{"$f":"AA1","v":"Yes"},{"$f":"AB1","v":"Yes"},"Yes","Yes","Yes",{"$f":"AH1","v":"Yes"},{"$f":"validation!A58","v":"Yes"},{"$f":"AJ1","v":"Yes"},{"$f":"validation!A59","v":"Yes"},{"$f":"AJ1","v":"Yes"},{"$f":"AM1","v":"Yes"},{"$f":"validation!A63","v":"Yes"},{"$f":"AM1","v":"Yes"},{"$f":"AP1","v":"Yes"},{"$f":"validation!A67","v":"Yes"},{"$f":"AP1","v":"Yes"},{"$f":"AS1","v":"Yes"},{"$f":"validation!A71","v":"Yes"},{"$f":"AS1","v":"Yes"},{"$f":"AV1","v":"Yes"},{"$f":"validation!A75","v":"Yes"},{"$f":"AX1","v":"Yes"},{"$f":"validation!A76","v":"Yes"},{"$f":"AX1","v":"Yes"},{"$f":"BA1","v":"Yes"},{"$f":"validation!A77","v":"Yes"},{"$f":"BA1","v":"Yes"},{"$f":"BB1","v":"Yes"},"Yes",{"$f":"BD1","v":"Yes"},{"$f":"BE1","v":"Yes"},{"$f":"BH1","v":"Yes"},{"$f":"validation!A81","v":"Yes"},{"$f":"BJ1","v":"Yes"},{"$f":"validation!A82","v":"Yes"},{"$f":"BJ1","v":"Yes"},{"$f":"BK1","v":"Yes"},{"$f":"BK1","v":"Yes"},{"$f":"BM1","v":"Yes"},{"$f":"BP1","v":"Yes"},{"$f":"validation!A83","v":"Yes"}]
["Missing data in mandatory variables",null,"Data type error - setting","Data type error - year","Data type error - source","Data type error - indicator_abbr","Data type error - indicator_name","Data type error - dimension","Data type error - subgroup","Data type error - estimate","Data type error - se","Data type error - ci_lb","Data type error - ci_ub","Data type error - population","Data type error - ","Data type error - setting_average","Data type error - iso3","Data type error - favourable_indicator","Data type error - indicator_scale","Data type error - ordered_dimension","Data type error - subgroup_order","Data type error - reference_subgroup",null,"indicator_abbr","indicator_name",null,"setting","year","source","indicator_abbr","indicator_name","setting_average",null,"iso3 code incorrect",null,"setting","iso3",null,"indicator_abbr","favourable_indicator",null,"indicator_abbr","indicator_scale",null,"dimension","ordered_dimension",null,"Ordered_dimension = 0 but subgroup_order is not 0",null,"subgroup","subgroup_order",null,"setting","year","source","indicator_abbr","dimension","subgroup_order",null,"Ordered_dimension = 1 but reference_subgroup is not 0",null,"setting","year","source","indicator_abbr","dimension",null,"Variables missing from the dataset"]
["row number",null,"row number","row number","row number","row number","row number","row number","row number","row number","row number","row number","row number","row number","row number","row number","row number","row number","row number","row number","row number","row number",null,null,null,null,null,null,null,null,null,null,null,"row number",null,null,null,null,null,null,null,null,null,null,null,null,null,"row number",null,null,null,null,null,null,null,null,null,null,null,"row number",null,null,null,null,null,null,null,"Variable"]
[2]
[3]
[4]
[5]
[6]
{"$rows_left_out":30}
{"sheet":"lookups","index":7,"n_rows":195,"n_cols":2,"rows_kept":195,"cut":false,"hidden":false,"merged":[]}
["iso3","country"]
["AFG","Afghanistan"]
["ALB","Albania"]
["DZA","Algeria"]
["AND","Andorra"]
["AGO","Angola"]
["ATG","Antigua and Barbuda"]
["ARG","Argentina"]
{"$rows_left_out":187}